Target
Adenosine receptor A1
Ligand
BDBM50500486
Substrate
Meas. Tech.
ChEMBL_1543582 (CHEMBL3750700)
Ki
1950±n/a nM
Citation
 Ranganathan, AStoddart, LAHill, SJCarlsson, J Fragment-Based Discovery of Subtype-Selective Adenosine Receptor Ligands from Homology Models. J Med Chem 58:9578-90 (2015)  
Target
Name:
Adenosine receptor A1
Synonyms:
A1 adenosine receptor (hA1) AA1R_HUMAN ADORA1 Adenosine A1-receptor Adenosine receptor A1 (hA1) | Adenosine transporter (AdT)
Type:
G Protein-Coupled Receptor (GPCR)
Mol. Mass.:
36520.92
Organism:
Homo sapiens (Human)
Description:
P30542
Residue:
326
  
Inhibitor
Name:
BDBM50500486
Synonyms:
CHEMBL3745825
Type:
Small organic molecule
Emp. Form.:
C12H10N2O2S
Mol. Mass.:
246.285
SMILES:
Cc1sc2nc([nH]c(=O)c2c1C)-c1ccoc1
: