Target
Glutathione reductase, mitochondrial
Ligand
BDBM50052000
Substrate
Meas. Tech.
ChEMBL_72475 (CHEMBL685508)
IC50
1000±n/a nM
Citation
 Schönleben-Janas, AKirsch, PMittl, PRSchirmer, RHKrauth-Siegel, RL Inhibition of human glutathione reductase by 10-arylisoalloxazines: crystalline, kinetic, and electrochemical studies. J Med Chem 39:1549-54 (1996)  
Target
Name:
Glutathione reductase, mitochondrial
Synonyms:
GLUR GSHR_HUMAN Glutathione reductase | Glutathione reductase (GR)
Type:
Enzyme
Mol. Mass.:
56271.52
Organism:
Homo sapiens (Human)
Description:
P00390
Residue:
522
  
Inhibitor
Name:
BDBM50052000
Synonyms:
10-(3-Trifluoromethyl-phenyl)-10H-benzo[g]pteridine-2,4-dione | CHEMBL39225
Type:
Small organic molecule
Emp. Form.:
C17H9F3N4O2
Mol. Mass.:
358.2742
SMILES:
FC(F)(F)c1cccc(c1)-n1c2ccccc2nc2c1nc(=O)[nH]c2=O
: