Target
Acetylcholinesterase
Ligand
BDBM50502695
Substrate
Meas. Tech.
ChEMBL_1808256 (CHEMBL4307615)
IC50
0.306±n/a nM
Citation
 Zheng, SZhu, RZhou, XChen, LBai, HZhang, J Synthesis and biological evaluation of calycanthaceous alkaloid analogs. Bioorg Med Chem 27:0 (2019)  
Target
Name:
Acetylcholinesterase
Synonyms:
ACES_ELEEL Acetylcholinesterase (EeAChE) | ache
Type:
Enzyme
Mol. Mass.:
71812.79
Organism:
Electrophorus electricus (Electric eel)
Description:
Residue:
633
  
Inhibitor
Name:
BDBM50502695
Synonyms:
CHEMBL4535500
Type:
Small organic molecule
Emp. Form.:
C19H19FN2O2
Mol. Mass.:
326.3648
SMILES:
CN1C2N(CCCC2(O)c2ccccc12)C(=O)c1ccc(F)cc1
: