Target
Gag-Pol polyprotein [489-587]
Ligand
BDBM768
Substrate
Meas. Tech.
ChEMBL_157546 (CHEMBL764930)
Ki
800±n/a nM
Citation
 Romines, KRMorris, JKHowe, WJTomich, PKHorng, MMChong, KTHinshaw, RRAnderson, DJStrohbach, JWTurner, SRMizsak, SA Cycloalkylpyranones and cycloalkyldihydropyrones as HIV protease inhibitors: exploring the impact of ring size on structure-activity relationships. J Med Chem 39:4125-30 (1996)  
Target
Name:
Gag-Pol polyprotein [489-587]
Synonyms:
Human immunodeficiency virus type 1 protease Pol polyprotein | gag-pol
Type:
Enzyme Subunit
Mol. Mass.:
10781.16
Organism:
Human immunodeficiency virus type 1
Description:
P04585[489-587]
Residue:
99
  
Inhibitor
Name:
BDBM768
Synonyms:
4-hydroxy-3-(1-phenylpropyl)-2H-chromen-2-one phenprocoumon
Type:
Small organic molecule
Emp. Form.:
C18H16O3
Mol. Mass.:
280.3178
SMILES:
CCC(c1ccccc1)c1c(O)c2ccccc2oc1=O
: