Target
Proteasome subunit beta type-9
Ligand
BDBM50503685
Substrate
Meas. Tech.
ChEMBL_1811420 (CHEMBL4310880)
IC50
440±n/a nM
Citation
 Kato, HEl-Desoky, AHTakeishi, YNehira, TAngkouw, EDMangindaan, REPde Voogd, NJTsukamoto, S Tetradehydrohalicyclamine B, a new proteasome inhibitor from the marine sponge Acanthostrongylophora ingens. Bioorg Med Chem Lett 29:8-10 (2019)  
Target
Name:
Proteasome subunit beta type-9
Synonyms:
LMP2 Macropain chain 7 PSB9_HUMAN PSMB9 Proteasome subunit beta-1i Really interesting new gene 12 protein
Type:
PROTEIN
Mol. Mass.:
23256.49
Organism:
Homo sapiens (Human)
Description:
ChEMBL_106197
Residue:
219
  
Inhibitor
Name:
BDBM50503685
Synonyms:
CHEMBL4092241
Type:
Small organic molecule
Emp. Form.:
C26H42N2
Mol. Mass.:
382.6251
SMILES:
[H][C@]12CN3CC(=C1)[C@]1([H])CCN(C[C@@]1([H])CC\C=C/CCCC3)CCCC\C=C/CC2
: