Target
Prothrombin
Ligand
BDBM50054494
Substrate
Meas. Tech.
ChEMBL_208136 (CHEMBL816448)
IC50
1.12±n/a nM
Citation
 Semple, JERowley, DCBrunck, TKHa-Uong, TMinami, NKOwens, TDTamura, SYGoldman, EASiev, DVArdecky, RJCarpenter, SHGe, YRichard, BMNolan, TGHåkanson, KTulinsky, ANutt, RFRipka, WC Design, synthesis, and evolution of a novel, selective, and orally bioavailable class of thrombin inhibitors: P1-argininal derivatives incorporating P3-P4 lactam sulfonamide moieties. J Med Chem 39:4531-6 (1996)  
Target
Name:
Prothrombin
Synonyms:
Activation peptide fragment 1 Coagulation factor II Prothrombin precursor Thrombin heavy chain | Thrombin light chain
Type:
Protein
Mol. Mass.:
70029.57
Organism:
Homo sapiens (Human)
Description:
P00734
Residue:
622
  
Inhibitor
Name:
BDBM50054494
Synonyms:
2-({(S)-1-[((S)-3-Carbamimidoyl-2-hydroxy-cyclohexylcarbamoyl)-methyl]-2-oxo-azepan-3-ylsulfamoyl}-methyl)-benzoic acid methyl ester | CHEMBL337365
Type:
Small organic molecule
Emp. Form.:
C24H35N5O7S
Mol. Mass.:
537.629
SMILES:
COC(=O)c1ccccc1CS(=O)(=O)N[C@H]1CCCCN(CC(=O)N[C@H]2CCCC(C2O)C(N)=N)C1=O
: