Target
D(2) dopamine receptor
Ligand
BDBM50054712
Substrate
Meas. Tech.
ChEMBL_58195 (CHEMBL670363)
IC50
7.6±n/a nM
Citation
 Norman, MHNavas, FThompson, JBRigdon, GC Synthesis and evaluation of heterocyclic carboxamides as potential antipsychotic agents. J Med Chem 39:4692-703 (1997)  
Target
Name:
D(2) dopamine receptor
Synonyms:
DOPAMINE D2 Dopamine D2 receptor Drd2
Type:
Enzyme
Mol. Mass.:
50957.64
Organism:
Mus musculus (Mouse)
Description:
P61168
Residue:
444
  
Inhibitor
Name:
BDBM50054712
Synonyms:
3H-Benzoimidazole-4-carboxylic acid [4-(4-benzo[d]isothiazol-3-yl-piperazin-1-yl)-butyl]-amide | CHEMBL141319
Type:
Small organic molecule
Emp. Form.:
C23H26N6OS
Mol. Mass.:
434.557
SMILES:
O=C(NCCCCN1CCN(CC1)c1nsc2ccccc12)c1cccc2nc[nH]c12
: