Target
5-hydroxytryptamine receptor 1D
Ligand
BDBM50054764
Substrate
Meas. Tech.
ChEMBL_2000 (CHEMBL617093)
Ki
0.3±n/a nM
Citation
 Barf, TAde Boer, PWikström, HPeroutka, SJSwensson, KEnnis, MDGhazal, NBMcGuire, JCSmith, MW 5-HT1D receptor agonist properties of novel 2-[5-[[(trifluoromethyl)sulfonyl]oxy]indolyl]ethylamines and their use as synthetic intermediates. J Med Chem 39:4717-26 (1997)  
Target
Name:
5-hydroxytryptamine receptor 1D
Synonyms:
5-HT-1D 5-HT1D 5HT1D_HUMAN HTR1DA Serotonin (5-HT) receptor | Serotonin Receptor 1D
Type:
G Protein-Coupled Receptor (GPCR)
Mol. Mass.:
41920.63
Organism:
Homo sapiens (Human)
Description:
Receptor binding assays were performed using human clone stably expressed in CHO cells.
Residue:
377
  
Inhibitor
Name:
BDBM50054764
Synonyms:
(E)-3-[3-(2-Dimethylamino-ethyl)-1H-indol-5-yl]-N-(4-methoxy-benzyl)-acrylamide | CHEMBL344127
Type:
Small organic molecule
Emp. Form.:
C23H27N3O2
Mol. Mass.:
377.4794
SMILES:
COc1ccc(CNC(=O)\C=C\c2ccc3[nH]cc(CCN(C)C)c3c2)cc1
: