Target
Acidic mammalian chitinase
Ligand
BDBM50504022
Substrate
Meas. Tech.
ChEMBL_1813251 (CHEMBL4312825)
IC50
180±n/a nM
Citation
 Mazur, MDymek, BKoralewski, RSklepkiewicz, POlejniczak, SMazurkiewicz, MPiotrowicz, MSalamon, MJ?drzejczak, KZagozdzon, ACzestkowski, WMatyszewski, KBorek, BBartoszewicz, APluta, ERymaszewska, AMozga, WStefaniak, FDobrza?ski, PDzwonek, KGolab, JGolebiowski, AOlczak, J Development of Dual Chitinase Inhibitors as Potential New Treatment for Respiratory System Diseases. J Med Chem 62:7126-7145 (2019)  
Target
Name:
Acidic mammalian chitinase
Synonyms:
AMCase Chia YNL
Type:
PROTEIN
Mol. Mass.:
51991.60
Organism:
Mus musculus
Description:
ChEMBL_828636
Residue:
473
  
Inhibitor
Name:
BDBM50504022
Synonyms:
CHEMBL4464943
Type:
Small organic molecule
Emp. Form.:
C18H27ClN6O
Mol. Mass.:
378.9
SMILES:
C[C@H](O)CN(CCc1ccc(Cl)cc1)C1CCN(CC1)c1nc(N)n[nH]1
: