Target
Acidic mammalian chitinase
Ligand
BDBM50504021
Substrate
Meas. Tech.
ChEMBL_1813253 (CHEMBL4312827)
IC50
28±n/a nM
Citation
 Mazur, MDymek, BKoralewski, RSklepkiewicz, POlejniczak, SMazurkiewicz, MPiotrowicz, MSalamon, MJ?drzejczak, KZagozdzon, ACzestkowski, WMatyszewski, KBorek, BBartoszewicz, APluta, ERymaszewska, AMozga, WStefaniak, FDobrza?ski, PDzwonek, KGolab, JGolebiowski, AOlczak, J Development of Dual Chitinase Inhibitors as Potential New Treatment for Respiratory System Diseases. J Med Chem 62:7126-7145 (2019)  
Target
Name:
Acidic mammalian chitinase
Synonyms:
AMCase CHIA Lung-specific protein TSA1902
Type:
Protein
Mol. Mass.:
52266.66
Organism:
Homo sapiens (Human)
Description:
Q9BZP6
Residue:
476
  
Inhibitor
Name:
BDBM50504021
Synonyms:
CHEMBL4453964
Type:
Small organic molecule
Emp. Form.:
C18H28ClN7O2S
Mol. Mass.:
441.979
SMILES:
CNS(=O)(=O)CCN(CCc1ccc(Cl)cc1)C1CCN(CC1)c1nc(N)n[nH]1
: