Target
M-phase inducer phosphatase 2
Ligand
BDBM50504071
Substrate
Meas. Tech.
ChEMBL_1813305 (CHEMBL4312879)
Ki
7100±n/a nM
Citation
 Cerchia, CNasso, RMori, MVilla, SGelain, ACapasso, AAliotta, FSimonetti, MRullo, RMasullo, MDe Vendittis, ERuocco, MRLavecchia, A Discovery of Novel Naphthylphenylketone and Naphthylphenylamine Derivatives as Cell Division Cycle 25B (CDC25B) Phosphatase Inhibitors: Design, Synthesis, Inhibition Mechanism, and in Vitro Efficacy against Melanoma Cell Lines. J Med Chem 62:7089-7110 (2019)  
Target
Name:
M-phase inducer phosphatase 2
Synonyms:
CDC25B Dual specificity phosphatase (CDC25B) M-phase inducer phosphatase 2 (CDC25B) | MPIP2_HUMAN
Type:
Protein
Mol. Mass.:
64985.27
Organism:
Homo sapiens (Human)
Description:
Residue:
580
  
Inhibitor
Name:
BDBM50504071
Synonyms:
CHEMBL4470428
Type:
Small organic molecule
Emp. Form.:
C19H14O4
Mol. Mass.:
306.3121
SMILES:
COc1ccc(C(=O)c2ccccc2C(O)=O)c2ccccc12
: