Target
Prostaglandin G/H synthase 2
Ligand
BDBM50009860
Substrate
Meas. Tech.
ChEMBL_159895 (CHEMBL766723)
IC50
2500±n/a nM
Citation
 Kolasa, TBrooks, CDRodriques, KESummers, JBDellaria, JFHulkower, KIBouska, JBell, RLCarter, GW Nonsteroidal anti-inflammatory drugs as scaffolds for the design of 5-lipoxygenase inhibitors. J Med Chem 40:819-24 (1997)  
Target
Name:
Prostaglandin G/H synthase 2
Synonyms:
COX2 Cyclooxygenase 2 (COX-2) Cyclooxygenase-2 (COX-2 AA) Cyclooxygenase-2 (COX-2) PGH2_HUMAN PHS II Prostaglandin E synthase/G/H synthase 2 Prostaglandin-endoperoxide synthase 2
Type:
Enzyme
Mol. Mass.:
69003.89
Organism:
Homo sapiens (Human)
Description:
Recombinant Cox-2 provided by Cayman (Cayman Chemical Co.,Ann Arbor, MI).
Residue:
604
  
Inhibitor
Name:
BDBM50009860
Synonyms:
2-(6-Methoxy-naphthalen-2-yl)-propionic acid 2-(6-methoxy-2-naphthyl)propanoic acid CHEMBL154 Naproxen2-(6-Methoxy-naphthalen-2-yl)-propionic acid
Type:
Small organic molecule
Emp. Form.:
C14H14O3
Mol. Mass.:
230.2592
SMILES:
COc1ccc2cc(ccc2c1)C(C)C(O)=O
: