Target
Nonstructural protein 5A
Ligand
BDBM50505985
Substrate
Meas. Tech.
ChEMBL_1824459 (CHEMBL4324223)
IC50
0.136000±n/a nM
Citation
 Ramdas, VTalwar, RBanerjee, MJoshi, AADas, AKWalke, DSBorhade, PDhayagude, ULoriya, RGote, GBommakanti, ASivaram, AAgarwal, GGoswami, ANigade, PMehta, MPatil, VModi, DKumar, HMallurwar, SDash, AModi, FKuldharan, SSrivastava, PSingh, MNarasimham, LGundu, JSharma, SKamboj, RKPalle, VP Discovery and Characterization of Potent Pan-Genotypic HCV NS5A Inhibitors Containing Novel Tricyclic Central Core Leading to Clinical Candidate. J Med Chem 62:10563-10582 (2019)  
Target
Name:
Nonstructural protein 5A
Synonyms:
NS5A | Nonstructural protein 5A
Type:
PROTEIN
Mol. Mass.:
48587.20
Organism:
Hepatitis C virus
Description:
ChEMBL_108438
Residue:
447
  
Inhibitor
Name:
BDBM50505985
Synonyms:
CHEMBL2024204
Type:
Small organic molecule
Emp. Form.:
C46H54N8O6
Mol. Mass.:
814.971
SMILES:
COC(=O)N[C@@H](C(C)C)C(=O)N1CCC[C@H]1c1ncc([nH]1)-c1ccc(cc1)-c1ccc(cc1)-c1ccc(cc1)-c1cnc([nH]1)[C@@H]1CCCN1C(=O)[C@@H](NC(=O)OC)C(C)C
: