Target
Potassium voltage-gated channel subfamily H member 2
Ligand
BDBM66087
Substrate
Meas. Tech.
ChEMBL_1825747 (CHEMBL4325511)
IC50
>40000±n/a nM
Citation
 Hu, LFeng, HZhang, HYu, SZhao, QWang, WBao, FDing, XHu, JWang, MXu, YWu, ZLi, XTang, YMao, FChen, XZhang, HLi, J Development of Novel  J Med Chem 63:1051-1067 (2020)  
Target
Name:
Potassium voltage-gated channel subfamily H member 2
Synonyms:
1,3-beta-glucan synthase component GLS2 ERG Eag-related protein 1 Ether-a-go-go-related gene (HERG) Ether-a-go-go-related gene potassium channel 1 Ether-a-go-go-related gene potassium channel 1 (hERG1) Ether-a-go-go-related protein 1 H-ERG KCNH2 Potassium voltage-gated channel subfamily H member 2 (hERG) Voltage-gated potassium channel subunit Kv11.1 hERG Potassium Channel 1 | putative potassium channel subunit
Type:
Multi-pass membrane protein
Mol. Mass.:
126672.65
Organism:
Homo sapiens (Human)
Description:
Q12809
Residue:
1159
  
Inhibitor
Name:
BDBM66087
Synonyms:
2-aminoethanol;6-cyclohexyl-1-hydroxy-4-methyl-2-pyridinone 2-aminoethanol;6-cyclohexyl-1-hydroxy-4-methylpyridin-2-one Ciclopirox MLS002153867 cid_38911
Type:
Small organic molecule
Emp. Form.:
C12H17NO2
Mol. Mass.:
207.2689
SMILES:
Cc1cc(C2CCCCC2)n(O)c(=O)c1
: