Target
Cathepsin D
Ligand
BDBM50506521
Substrate
Meas. Tech.
ChEMBL_1826027 (CHEMBL4325791)
IC50
1.1±n/a nM
Citation
 Hou?tecká, RHadzima, MFanfrlík, JBrynda, JPallová, LHánová, IMertlíková-Kaiserová, HLep?ík, MHorn, MSmr?ina, MMajer, PMare?, M Biomimetic Macrocyclic Inhibitors of Human Cathepsin D: Structure-Activity Relationship and Binding Mode Analysis. J Med Chem 63:1576-1596 (2020)  
Target
Name:
Cathepsin D
Synonyms:
CATD_HUMAN CTSD Cathepsin D heavy chain Cathepsin D precursor
Type:
Enzyme
Mol. Mass.:
44551.72
Organism:
Homo sapiens (Human)
Description:
Human proCathepsin D (SwissProt accession number P07339) was expressed in Sf9 cells, purified, and autoactivated.
Residue:
412
  
Inhibitor
Name:
BDBM50506521
Synonyms:
CHEMBL4558691
Type:
Small organic molecule
Emp. Form.:
C31H44N4O4
Mol. Mass.:
536.7055
SMILES:
O[C@H]1CC(=O)N[C@@H](Cc2cccnc2)C(=O)NCCCCCCCCCCCC(=O)N[C@H]1Cc1ccccc1
: