Target
Serine/threonine-protein kinase WNK3
Ligand
BDBM50240826
Substrate
Meas. Tech.
ChEMBL_1828781 (CHEMBL4328655)
IC50
2310±n/a nM
Citation
 Narayan, SRamisetti, SJaiswal, ASLaw, BKSingh-Pillay, ASingh, PAmin, SSharma, AK ASR352, A potent anticancer agent: Synthesis, preliminary SAR, and biological activities against colorectal cancer bulk, 5-fluorouracil/oxaliplatin resistant and stem cells. Eur J Med Chem 161:456-467 (2019)  
Target
Name:
Serine/threonine-protein kinase WNK3
Synonyms:
KIAA1566 Protein kinase lysine-deficient 3 WNK3 | WNK3_HUMAN
Type:
PROTEIN
Mol. Mass.:
198400.78
Organism:
Homo sapiens (Human)
Description:
ChEMBL_959020
Residue:
1800
  
Inhibitor
Name:
BDBM50240826
Synonyms:
AZD-1775 US11124518, Example AZD1775 US11479555, Example AZD1775
Type:
Small organic molecule
Emp. Form.:
C27H32N8O2
Mol. Mass.:
500.5954
SMILES:
CN1CCN(CC1)c1ccc(Nc2ncc3c(n2)n(-c2cccc(n2)C(C)(C)O)n(CC=C)c3=O)cc1
: