Target
Myeloperoxidase
Ligand
BDBM50507396
Substrate
Meas. Tech.
ChEMBL_1829870 (CHEMBL4329744)
IC50
6.7±n/a nM
Citation
 Wurtz, NRViet, AShaw, SADilger, AValente, MNKhan, JAJusuf, SNarayanan, RFernando, GLo, FLiu, XLocke, GAKopcho, LAbell, LMSleph, PBasso, MZhao, LWexler, RRDuclos, FKick, EK Potent Triazolopyridine Myeloperoxidase Inhibitors. ACS Med Chem Lett 9:1175-1180 (2018)  
Target
Name:
Myeloperoxidase
Synonyms:
84 kDa myeloperoxidase MPO Myeloperoxidase Myeloperoxidase heavy chain PERM_HUMAN
Type:
Enzyme
Mol. Mass.:
83888.32
Organism:
Homo sapiens (Human)
Description:
P05164
Residue:
745
  
Inhibitor
Name:
BDBM50507396
Synonyms:
CHEMBL4453728
Type:
Small organic molecule
Emp. Form.:
C12H9Cl2N5O
Mol. Mass.:
310.139
SMILES:
Nc1cc(OCc2c(Cl)cccc2Cl)c2nn[nH]c2n1
: