Target
Carbonic anhydrase 14
Ligand
BDBM50117672
Substrate
Meas. Tech.
ChEMBL_1831757 (CHEMBL4331765)
Ki
39±n/a nM
Citation
 Buemi, MRDi Fiore, ADe Luca, LAngeli, AMancuso, FFerro, SMonti, SMBuonanno, MRusso, EDe Sarro, GDe Simone, GSupuran, CTGitto, R Exploring structural properties of potent human carbonic anhydrase inhibitors bearing a 4-(cycloalkylamino-1-carbonyl)benzenesulfonamide moiety. Eur J Med Chem 163:443-452 (2019)  
Target
Name:
Carbonic anhydrase 14
Synonyms:
CA-XIV CAH14_HUMAN Carbonic Anhydrase XIV Carbonic anhydrase 14 Carbonic anhydrase XIV (CA XIV)
Type:
Enzyme
Mol. Mass.:
37665.67
Organism:
Homo sapiens (Human)
Description:
Human (cloned) isozyme.
Residue:
337
  
Inhibitor
Name:
BDBM50117672
Synonyms:
CHEMBL3613783
Type:
Small organic molecule
Emp. Form.:
C16H16N2O3S
Mol. Mass.:
316.375
SMILES:
NS(=O)(=O)c1ccc(cc1)C(=O)N1CCCc2ccccc12
: