Target
Poly(ADP-ribose) glycohydrolase
Ligand
BDBM50508415
Substrate
Meas. Tech.
ChEMBL_1833003 (CHEMBL4333011)
IC50
20±n/a nM
Citation
 Acton, BSmall, HFSmith, KMMcGonagle, AStowell, AIJJames, DIHamilton, NMHamilton, NHitchin, JRHutton, CPWaddell, IDOgilvie, DJJordan, AM Fluoromethylcyclopropylamine derivatives as potential in vivo toxicophores - A cautionary disclosure. Bioorg Med Chem Lett 29:560-562 (2019)  
Target
Name:
Poly(ADP-ribose) glycohydrolase
Synonyms:
PARG Poly(ADP-ribose) glycohydrolase | poly(ADP-ribose) glycohydrolase (PARG)
Type:
Protein
Mol. Mass.:
111107.13
Organism:
Homo sapiens (Human)
Description:
Q86W56
Residue:
976
  
Inhibitor
Name:
BDBM50508415
Synonyms:
CHEMBL4459798
Type:
Small organic molecule
Emp. Form.:
C22H24FN7O4S
Mol. Mass.:
501.534
SMILES:
Cn1ccc(Cn2c3ccc(cc3c(=O)n(Cc3cnn(C)c3)c2=O)S(=O)(=O)NC2(CF)CC2)n1
: