Target
Prolyl 4-hydroxylase
Ligand
BDBM26106
Substrate
Meas. Tech.
ChEMBL_1840409 (CHEMBL4340708)
Ki
48740±n/a nM
Citation
 Langley, GWAbboud, MILohans, CTSchofield, CJ Inhibition of a viral prolyl hydroxylase. Bioorg Med Chem 27:2405-2412 (2019)  
Target
Name:
Prolyl 4-hydroxylase
Synonyms:
A085R | Prolyl 4-hydroxylase
Type:
PROTEIN
Mol. Mass.:
27815.10
Organism:
Paramecium bursaria Chlorella virus 1
Description:
ChEMBL_119118
Residue:
242
  
Inhibitor
Name:
BDBM26106
Synonyms:
CHEMBL90852 NOG [(carboxymethyl)carbamoyl]formic acid
Type:
Small organic molecule
Emp. Form.:
C4H5NO5
Mol. Mass.:
147.0862
SMILES:
OC(=O)CNC(=O)C(O)=O
: