Target
V-type proton ATPase subunit S1
Ligand
BDBM50064439
Substrate
Meas. Tech.
ChEMBL_215469 (CHEMBL816939)
IC50
>10000±n/a nM
Citation
 Gagliardi, SGatti, PABelfiore, PZocchetti, AClarke, GDFarina, C Synthesis and structure-activity relationships of bafilomycin A1 derivatives as inhibitors of vacuolar H+-ATPase. J Med Chem 41:1883-93 (1998)  
Target
Name:
V-type proton ATPase subunit S1
Synonyms:
ATP6AP1 ATP6S1 V-ATPase Ac45 subunit V-ATPase subunit S1 VAS1_HUMAN Vacuolar ATP synthase subunit S1 XAP3
Type:
PROTEIN
Mol. Mass.:
52022.67
Organism:
Homo sapiens (Human)
Description:
ChEMBL_215469
Residue:
470
  
Inhibitor
Name:
BDBM50064439
Synonyms:
(2S,3R,4S)-4-((4E,6E,12E,14Z)-(2R,3S,9S,11R)-3,15-Dimethoxy-7,9,11,13-tetramethyl-10,16-dioxo-oxacyclohexadeca-4,6,12,14-tetraen-2-yl)-3-hydroxy-2-methyl-pentanoic acid | CHEMBL55768
Type:
Small organic molecule
Emp. Form.:
C27H40O8
Mol. Mass.:
492.6017
SMILES:
CO[C@H]1\C=C\C=C(C)\C[C@H](C)C(=O)[C@H](C)\C=C(/C)\C=C(OC)\C(=O)O[C@@H]1[C@@H](C)[C@@H](O)[C@H](C)C(O)=O
: