Target
5-hydroxytryptamine receptor 1A
Ligand
BDBM50064584
Substrate
Meas. Tech.
ChEMBL_561 (CHEMBL615581)
IC50
0.6±n/a nM
Citation
 Taverne, TDiouf, ODepreux, PPoupaert, JHLesieur, DGuardiola-Lemaître, BRenard, PRettori, MCCaignard, DHPfeiffer, B Novel benzothiazolin-2-one and benzoxazin-3-one arylpiperazine derivatives with mixed 5HT1A/D2 affinity as potential atypical antipsychotics. J Med Chem 41:2010-8 (1998)  
Target
Name:
5-hydroxytryptamine receptor 1A
Synonyms:
5-HT-1A 5-hydroxytryptamine receptor 1A (5-HT-1A) ADRB2RL1 Dopamine D2 receptor and serotonin 1a receptor HTR1A | Serotonin receptor 1A
Type:
Mol. Mass.:
46122.49
Organism:
Homo sapiens (Human)
Description:
Residue:
422
  
Inhibitor
Name:
BDBM50064584
Synonyms:
4-Methyl-7-{4-[4-(3-trifluoromethyl-phenyl)-piperazin-1-yl]-butyl}-4H-benzo[1,4]oxazin-3-one | CHEMBL64610
Type:
Small organic molecule
Emp. Form.:
C24H28F3N3O2
Mol. Mass.:
447.4932
SMILES:
CN1C(=O)COc2cc(CCCCN3CCN(CC3)c3cccc(c3)C(F)(F)F)ccc12
: