Target
Beta-secretase 1
Ligand
BDBM50510787
Substrate
Meas. Tech.
ChEMBL_1842176 (CHEMBL4342603)
IC50
0.157000±n/a nM
Citation
 Hsiao, CCRombouts, FGijsen, HJM New evolutions in the BACE1 inhibitor field from 2014 to 2018. Bioorg Med Chem Lett 29:761-777 (2019)  
Target
Name:
Beta-secretase 1
Synonyms:
ASP2 Aspartyl protease 2 BACE1 Beta-secretase (BACE) Beta-secretase 1 (BACE 1) Beta-secretase 1 (BACE1) Beta-site amyloid precursor protein cleaving enzyme 1 Memapsin-2 beta-Secretase (BACE-1) | beta-Secretase (BACE1)
Type:
Protein
Mol. Mass.:
55755.10
Organism:
Homo sapiens (Human)
Description:
P56817
Residue:
501
  
Inhibitor
Name:
BDBM50510787
Synonyms:
CHEMBL4564324
Type:
Small organic molecule
Emp. Form.:
C21H18F3N5O2S
Mol. Mass.:
461.46
SMILES:
[H][C@]12CSC(N)=N[C@]1(CO[C@@H]2C(C)(F)F)c1cc(NC(=O)c2ccc(cn2)C#N)ccc1F
: