Target
Arginase-1
Ligand
BDBM50511658
Substrate
Meas. Tech.
ChEMBL_1845399 (CHEMBL4345826)
IC50
98±n/a nM
Citation
 Blaszczyk, RBrzezinska, JDymek, BStanczak, PSMazurkiewicz, MOlczak, JNowicka, JDzwonek, KZagozdzon, AGolab, JGolebiowski, A Discovery and Pharmacokinetics of Sulfamides and Guanidines as Potent Human Arginase 1 Inhibitors. ACS Med Chem Lett 11:433-438 (2020)  
Target
Name:
Arginase-1
Synonyms:
ARG1 Liver-type arginase | Type I arginase
Type:
PROTEIN
Mol. Mass.:
34737.53
Organism:
Homo sapiens (Human)
Description:
ChEMBL_978893
Residue:
322
  
Inhibitor
Name:
BDBM50511658
Synonyms:
Cb-1158 Incb 001158 Numidargistat
Type:
Small organic molecule
Emp. Form.:
C11H22BN3O5
Mol. Mass.:
287.12
SMILES:
C[C@H](N)C(=O)N1C[C@H](CCCB(O)O)[C@@](N)(C1)C(O)=O
: