Target
Dihydroxyacetone phosphate acyltransferase
Ligand
BDBM50068942
Substrate
Meas. Tech.
ChEMBL_53900 (CHEMBL665111)
IC50
800±n/a nM
Citation
 Cox, RJSchouten, JAStentiford, RAWareing, KJ Peptide inhibitors of N-succinyl diaminopimelic acid aminotransferase (DAP-AT): a novel class of antimicrobial compounds. Bioorg Med Chem Lett 8:945-50 (1999)  
Target
Name:
Dihydroxyacetone phosphate acyltransferase
Synonyms:
Acyl-CoA:dihydroxyacetonephosphateacyltransferase DHAPAT GNPAT_HUMAN
Type:
PROTEIN
Mol. Mass.:
77187.04
Organism:
Homo sapiens (Human)
Description:
ChEMBL_53899
Residue:
680
  
Inhibitor
Name:
BDBM50068942
Synonyms:
(S)-2-((S)-2-Acetylamino-3-carboxy-propionylamino)-6-hydrazino-heptanedioic acid | CHEMBL176303
Type:
Small organic molecule
Emp. Form.:
C13H22N4O8
Mol. Mass.:
362.3358
SMILES:
CC(=O)N[C@@H](CC(O)=O)C(=O)N[C@@H](CCCC(NN)C(O)=O)C(O)=O
: