Target
Histone deacetylase 6
Ligand
BDBM50252391
Substrate
Meas. Tech.
ChEMBL_1854948 (CHEMBL4355677)
IC50
0.810000±n/a nM
Citation
 Shen, SHadley, MUstinova, KPavlicek, JKnox, TNoonepalle, STavares, MTZimprich, CAZhang, GRobers, MBBa?inka, CKozikowski, APVillagra, A Discovery of a New Isoxazole-3-hydroxamate-Based Histone Deacetylase 6 Inhibitor SS-208 with Antitumor Activity in Syngeneic Melanoma Mouse Models. J Med Chem 62:8557-8577 (2019)  
Target
Name:
Histone deacetylase 6
Synonyms:
Cereblon/Histone deacetylase 6 HDAC6 Histone deacetylase 6 (HDAC6) KIAA0901 | ORF Names:JM21
Type:
Chromatin regulator; hydrolase; repressor
Mol. Mass.:
131381.51
Organism:
Homo sapiens (Human)
Description:
Q9UBN7
Residue:
1215
  
Inhibitor
Name:
BDBM50252391
Synonyms:
CHEMBL4080014
Type:
Small organic molecule
Emp. Form.:
C16H14FN3O2
Mol. Mass.:
299.2997
SMILES:
Cc1nc2ccccc2n1Cc1ccc(cc1F)C(=O)NO
: