Target
GTPase KRas
Ligand
BDBM50514396
Substrate
Meas. Tech.
ChEMBL_1856530 (CHEMBL4357259)
IC50
90±n/a nM
Target
Name:
GTPase KRas
Synonyms:
GTPase KRas, N-terminally processed KRAS Ki-Ras RASK_HUMAN c-Ki-ras
Type:
PROTEIN
Mol. Mass.:
21656.10
Organism:
Homo sapiens (Human)
Description:
ChEMBL_1476955
Residue:
189
  
Inhibitor
Name:
BDBM50514396
Synonyms:
CHEMBL4452622
Type:
Small organic molecule
Emp. Form.:
C31H31F2N5O3
Mol. Mass.:
559.6063
SMILES:
CC(C)c1cccc(C)c1-n1c2nc(c(F)cc2c(nc1=O)N1CCN(C[C@@H]1C)C(=O)C=C)-c1c(O)cccc1F
: