Target
Chitotriosidase-1
Ligand
BDBM50514507
Substrate
Meas. Tech.
ChEMBL_1856959 (CHEMBL4357688)
Ki
1120±n/a nM
Citation
 Jiang, XKumar, AMotomura, YLiu, TZhou, YMoro, KZhang, KYJYang, Q A Series of Compounds Bearing a Dipyrido-Pyrimidine Scaffold Acting as Novel Human and Insect Pest Chitinase Inhibitors. J Med Chem 63:987-1001 (2020)  
Target
Name:
Chitotriosidase-1
Synonyms:
CHIT1 Chitinase 1 Chitotriosidase Chitotriosidase-1 (CHIT1)
Type:
Enzyme
Mol. Mass.:
51682.25
Organism:
Homo sapiens (Human)
Description:
Q13231
Residue:
466
  
Inhibitor
Name:
BDBM50514507
Synonyms:
CHEMBL1583158
Type:
Small organic molecule
Emp. Form.:
C24H24N6O3
Mol. Mass.:
444.4858
SMILES:
Cc1cccn2c1nc1n(CC3CCCO3)c(=N)c(cc1c2=O)C(=O)NCc1cccnc1
: