Target
Chromatin remodeling regulator CECR2
Ligand
BDBM50514858
Substrate
Meas. Tech.
ChEMBL_1858859 (CHEMBL4359588)
IC50
20±n/a nM
Citation
 Lucas, SCCAtkinson, SJBamborough, PBarnett, HChung, CWGordon, LMitchell, DJPhillipou, APrinjha, RKSheppard, RJTomkinson, NCOWatson, RJDemont, EH Optimization of Potent ATAD2 and CECR2 Bromodomain Inhibitors with an Atypical Binding Mode. J Med Chem 63:5212-5241 (2020)  
Target
Name:
Chromatin remodeling regulator CECR2
Synonyms:
CECR2 Cat eye syndrome critical region protein 2 | KIAA1740
Type:
PROTEIN
Mol. Mass.:
164223.89
Organism:
Homo sapiens (Human)
Description:
ChEMBL_107999
Residue:
1484
  
Inhibitor
Name:
BDBM50514858
Synonyms:
CHEMBL4577486
Type:
Small organic molecule
Emp. Form.:
C21H27ClN6O3S
Mol. Mass.:
478.995
SMILES:
CN1CCc2c(C1)nnn2CC(=O)Nc1ccc(Cl)c(c1)S(=O)(=O)N1CC[C@@H](C1)C1CC1
: