Target
17-beta-hydroxysteroid dehydrogenase type 1
Ligand
BDBM50515443
Substrate
Meas. Tech.
ChEMBL_1861098 (CHEMBL4361954)
IC50
2.3±n/a nM
Citation
 Abdelsamie, ASSalah, MSiebenbürger, LMerabet, AScheuer, CFrotscher, MMüller, STZierau, OVollmer, GMenger, MDLaschke, MWvan Koppen, CJMarchais-Oberwinkler, SHartmann, RW Design, Synthesis, and Biological Characterization of Orally Active 17?-Hydroxysteroid Dehydrogenase Type 2 Inhibitors Targeting the Prevention of Osteoporosis. J Med Chem 62:7289-7301 (2019)  
Target
Name:
17-beta-hydroxysteroid dehydrogenase type 1
Synonyms:
17-beta-HSD 1 17-beta-hydroxysteroid dehydrogenase type 1 20-alpha-HSD E17KSR EDH17B1 EDHB17 Estradiol 17-beta-dehydrogenase 1 (17beta-HSD1) Placental 17-beta-hydroxysteroid dehydrogenase | SDR28C1
Type:
Enzyme
Mol. Mass.:
34945.13
Organism:
Homo sapiens (Human)
Description:
P14061
Residue:
328
  
Inhibitor
Name:
BDBM50515443
Synonyms:
CHEMBL4443578
Type:
Small organic molecule
Emp. Form.:
C23H12F5NO4S2
Mol. Mass.:
525.468
SMILES:
Oc1c(F)c(F)cc(C(=O)c2ccc(s2)-c2ccc(F)c(NS(=O)(=O)c3ccc(F)cc3)c2)c1F
: