Target
Chromobox protein homolog 7
Ligand
BDBM50515922
Substrate
Meas. Tech.
ChEMBL_1862780 (CHEMBL4363636)
Kd
3900±n/a nM
Citation
 Yang, LLiu, YFan, MZhu, GJin, HLiang, JLiu, ZHuang, ZZhang, L Identification and characterization of benzo[d]oxazol-2(3H)-one derivatives as the first potent and selective small-molecule inhibitors of chromodomain protein CDYL. Eur J Med Chem 182:0 (2019)  
Target
Name:
Chromobox protein homolog 7
Synonyms:
CBX7 Chromobox protein homolog 7 | Chromobox protein homolog 7 (CBX7)
Type:
Protein
Mol. Mass.:
28351.76
Organism:
Homo sapiens (Human)
Description:
Residue:
251
  
Inhibitor
Name:
BDBM50515922
Synonyms:
CHEMBL4542090
Type:
Small organic molecule
Emp. Form.:
C18H17NO6
Mol. Mass.:
343.3307
SMILES:
COc1ccc2oc(=O)n(CC(=O)c3ccc(OC)c(OC)c3)c2c1
: