Target
Adenosine receptor A1
Ligand
BDBM21220
Substrate
Meas. Tech.
ChEMBL_1868856 (CHEMBL4369922)
Ki
0.450000±n/a nM
Citation
 Tosh, DKRao, HBitant, ASalmaso, VMannes, PLieberman, DIVaughan, KLMattison, JARothwell, ACAuchampach, JACiancetta, ALiu, NCui, ZGao, ZGReitman, MLGavrilova, OJacobson, KA Design and in Vivo Characterization of A J Med Chem 62:1502-1522 (2019)  
Target
Name:
Adenosine receptor A1
Synonyms:
AA1R_MOUSE Adenosine receptor A1 | Adora1
Type:
PROTEIN
Mol. Mass.:
36646.06
Organism:
Mus musculus
Description:
ChEMBL_479902
Residue:
326
  
Inhibitor
Name:
BDBM21220
Synonyms:
(2S,3S,4R,5R)-5-(6-amino-9H-purin-9-yl)-N-ethyl-3,4-dihydroxyoxolane-2-carboxamide Adenosine, N6-Ethyl-carboxamido CHEMBL464859 NECA
Type:
Antineoplastic Agent
Emp. Form.:
C12H16N6O4
Mol. Mass.:
308.2932
SMILES:
CCNC(=O)[C@H]1O[C@H]([C@H](O)[C@@H]1O)n1cnc2c(N)ncnc12
: