Target
Adenosine receptor A3
Ligand
BDBM50517307
Substrate
Meas. Tech.
ChEMBL_1868862 (CHEMBL4369928)
Ki
30±n/a nM
Citation
 Tosh, DKRao, HBitant, ASalmaso, VMannes, PLieberman, DIVaughan, KLMattison, JARothwell, ACAuchampach, JACiancetta, ALiu, NCui, ZGao, ZGReitman, MLGavrilova, OJacobson, KA Design and in Vivo Characterization of A J Med Chem 62:1502-1522 (2019)  
Target
Name:
Adenosine receptor A3
Synonyms:
A3AR Adenosine A3 receptor Gpcr2
Type:
PROTEIN
Mol. Mass.:
36460.91
Organism:
Mus musculus
Description:
ChEMBL_1515686
Residue:
319
  
Inhibitor
Name:
BDBM50517307
Synonyms:
CHEMBL4463802
Type:
Small organic molecule
Emp. Form.:
C22H27ClN6O3
Mol. Mass.:
458.941
SMILES:
[H][C@]12C[C@]1([C@@H](O)[C@@H](O)[C@@H]2n1cnc2c(N[C@H]3C[C@@]4([H])CC[C@]3([H])C4)nc(Cl)nc12)C(=O)NC1CC1
: