Target
Proteasome subunit beta type-10
Ligand
BDBM50517604
Substrate
Meas. Tech.
ChEMBL_1869406 (CHEMBL4370472)
IC50
159±n/a nM
Citation
 Xin, BTHuber, EMde Bruin, GHeinemeyer, WMaurits, EEspinal, CDu, YJanssens, MWeyburne, ESKisselev, AFFlorea, BIDriessen, Cvan der Marel, GAGroll, MOverkleeft, HS Structure-Based Design of Inhibitors Selective for Human Proteasome ?2c or ?2i Subunits. J Med Chem 62:1626-1642 (2019)  
Target
Name:
Proteasome subunit beta type-10
Synonyms:
LMP10 MECL1 Multicatalytic endopeptidase complex subunit MECl-1 PSMB10 Proteasome subunit beta-2i
Type:
PROTEIN
Mol. Mass.:
28940.51
Organism:
Homo sapiens (Human)
Description:
ChEMBL_106197
Residue:
273
  
Inhibitor
Name:
BDBM50517604
Synonyms:
CHEMBL4513509
Type:
Small organic molecule
Emp. Form.:
C35H52N4O7
Mol. Mass.:
640.81
SMILES:
[H][C@]12CCCC[C@@]1([H])[C@H](C[C@H](NC(=O)[C@H](Cc1ccc(OC)cc1)NC(=O)[C@H](C)NC(=O)CN1CCOCC1)C(=O)[C@@]1(C)CO1)CCC2
: