Target
Mu-type opioid receptor
Ligand
BDBM50045772
Substrate
Meas. Tech.
ChEMBL_221928 (CHEMBL842493)
Ki
80±n/a nM
Citation
 Thomas, JBMascarella, SWBurgess, JPXu, HMcCullough, KBRothman, RBFlippen-Anderson, JLGeorge, CFCantrell, BEZimmerman, DMCarroll, FI N-substituted octahydro-4a-(3-hydroxyphenyl)-10a-methyl-benzo[g]isoquinolines are opioid receptor pure antagonists. Bioorg Med Chem Lett 8:3149-52 (1999)  
Target
Name:
Mu-type opioid receptor
Synonyms:
M-OR-1 Mu opioid receptor OPIATE Mu OPRM_CAVPO
Type:
Enzyme Catalytic Domain
Mol. Mass.:
11165.58
Organism:
GUINEA PIG
Description:
P97266
Residue:
98
  
Inhibitor
Name:
BDBM50045772
Synonyms:
3-((3R,4R)-1,3,4-Trimethyl-piperidin-4-yl)-phenol CHEMBL318723
Type:
Small organic molecule
Emp. Form.:
C14H21NO
Mol. Mass.:
219.3226
SMILES:
C[C@H]1CN(C)CC[C@@]1(C)c1cccc(O)c1
: