Target
Beta-1 adrenergic receptor
Ligand
BDBM50518977
Substrate
Meas. Tech.
ChEMBL_1873766 (CHEMBL4375055)
IC50
5.9±n/a nM
Citation
 Gaiser, BIDanielsen, MMarcher-Rørsted, ERøpke Jørgensen, KWróbel, TMFrykman, MJohansson, HBräuner-Osborne, HGloriam, DEMathiesen, JMSejer Pedersen, D Probing the Existence of a Metastable Binding Site at the ? J Med Chem 62:7806-7839 (2019)  
Target
Name:
Beta-1 adrenergic receptor
Synonyms:
ADRB1 ADRB1_HUMAN Beta-1 adrenoceptor | adrenergic Beta1
Type:
G Protein-Coupled Receptor (GPCR)
Mol. Mass.:
51338.40
Organism:
Homo sapiens (Human)
Description:
P08588
Residue:
477
  
Inhibitor
Name:
BDBM50518977
Synonyms:
CHEMBL1160734
Type:
Small organic molecule
Emp. Form.:
C15H23NO2
Mol. Mass.:
249.3486
SMILES:
CC(C)NC[C@H](O)COc1ccccc1CC=C
: