Target
Histone-lysine N-methyltransferase EHMT2
Ligand
BDBM50446376
Substrate
Meas. Tech.
ChEMBL_1875894 (CHEMBL4377288)
IC50
3.0±n/a nM
Citation
 Xiong, YGreschik, HJohansson, CSeifert, LBacher, JPark, KSBabault, NMartini, MFagan, VLi, FChau, IChristott, TDilworth, DBarsyte-Lovejoy, DVedadi, MArrowsmith, CHBrennan, PFedorov, OJung, MFarnie, GLiu, JOppermann, USchüle, RJin, J Discovery of a Potent and Selective Fragment-like Inhibitor of Methyllysine Reader Protein Spindlin 1 (SPIN1). J Med Chem 62:8996-9007 (2019)  
Target
Name:
Histone-lysine N-methyltransferase EHMT2
Synonyms:
BAT8 EHMT2 G9A Histone-lysine N-methyltransferase EHMT1/EHMT2 KMT1C Protein G9a (G9a)
Type:
Enzyme
Mol. Mass.:
132339.87
Organism:
Homo sapiens (Human)
Description:
Q96KQ7
Residue:
1210
  
Inhibitor
Name:
BDBM50446376
Synonyms:
CHEMBL3109630
Type:
Small organic molecule
Emp. Form.:
C19H27N3O2
Mol. Mass.:
329.4366
SMILES:
COc1cc2c(cc1OCCCN1CCCC1)N=C(N)C21CCC1
: