Target
Wee1-like protein kinase 2
Ligand
BDBM50519662
Substrate
Meas. Tech.
ChEMBL_1878093 (CHEMBL4379487)
IC50
>10000±n/a nM
Citation
 Zhao, LLi, YWang, YQiao, ZMiao, ZYang, JHuang, LTian, CLi, LChen, DYang, S Discovery of 4 J Med Chem 62:10691-10710 (2019)  
Target
Name:
Wee1-like protein kinase 2
Synonyms:
WEE1B WEE2_HUMAN
Type:
PROTEIN
Mol. Mass.:
62923.50
Organism:
Homo sapiens (Human)
Description:
ChEMBL_774226
Residue:
567
  
Inhibitor
Name:
BDBM50519662
Synonyms:
CHEMBL4438748
Type:
Small organic molecule
Emp. Form.:
C26H23N3O5
Mol. Mass.:
457.4779
SMILES:
CN(C)c1ccc(cc1)C(=O)Nc1cccc(NC(=O)COc2ccc3c(c2)occc3=O)c1
: