Target
Transient receptor potential cation channel subfamily V member 1
Ligand
BDBM20461
Substrate
Meas. Tech.
ChEMBL_1878115 (CHEMBL4379509)
Ki
1070±n/a nM
Citation
 Ann, JKim, HSThorat, SAKim, HHa, HJChoi, KKim, YHKim, MHwang, SWPearce, LVEsch, TETurcios, NABlumberg, PMLee, J Discovery of Nonpungent Transient Receptor Potential Vanilloid 1 (TRPV1) Agonist as Strong Topical Analgesic. J Med Chem 63:418-424 (2020)  
Target
Name:
Transient receptor potential cation channel subfamily V member 1
Synonyms:
Capsaicin receptor Osm-9-like TRP channel 1 TRPV1_HUMAN Transient receptor potential cation channel subfamily V member 1 (TRPV1) Transient receptor potential cation channel subfamily V member 1(TRPV1) Vanilloid VR1 Vanilloid receptor 1 Vanilloid receptor 1 (VRI/TRPV1)
Type:
Protein
Mol. Mass.:
94960.75
Organism:
Homo sapiens (Human)
Description:
Q8NER1
Residue:
839
  
Inhibitor
Name:
BDBM20461
Synonyms:
(6E)-N-[(4-hydroxy-3-methoxyphenyl)methyl]-8-methylnon-6-enamide CAP Capsaicin | Zostrix
Type:
Emp. Form.:
C18H27NO3
Mol. Mass.:
305.4119
SMILES:
COc1cc(CNC(=O)CCCC\C=C\C(C)C)ccc1O
: