Target
Ribosomal protein S6 kinase alpha-6
Ligand
BDBM50520159
Substrate
Meas. Tech.
ChEMBL_1879131 (CHEMBL4380525)
IC50
7.0±n/a nM
Citation
 Lefranc, JSchulze, VKHillig, RCBriem, HPrinz, FMengel, AHeinrich, TBalint, JRengachari, SIrlbacher, HStöckigt, DBömer, UBader, BGradl, SNNising, CFvon Nussbaum, FMumberg, DPanne, DWengner, AM Discovery of BAY-985, a Highly Selective TBK1/IKK? Inhibitor. J Med Chem 63:601-612 (2020)  
Target
Name:
Ribosomal protein S6 kinase alpha-6
Synonyms:
90 kDa ribosomal protein S6 kinase 6 RPS6KA6 RPS6KA6(Kin.Dom.2 - C-terminal) RSK4 Ribosomal S6 kinase 4 Ribosomal protein S6 kinase alpha 6 (RSK4) S6K-alpha 6 p90RSK | pp90RSK4
Type:
Serine/threonine-protein kinase
Mol. Mass.:
83868.06
Organism:
Homo sapiens (Human)
Description:
Residue:
745
  
Inhibitor
Name:
BDBM50520159
Synonyms:
CHEMBL4543618
Type:
Small organic molecule
Emp. Form.:
C28H31F3N8O2
Mol. Mass.:
568.5933
SMILES:
CC(C)Oc1cncnc1-c1ccc2nc(Nc3cc(ccn3)[C@@H](C)N3CCN(CC3)C(=O)CC(F)(F)F)[nH]c2c1
: