Target
Somatostatin receptor type 2
Ligand
BDBM50075290
Substrate
Meas. Tech.
ChEBML_200682
Ki
4.6±n/a nM
Citation
 Pasternak, APan, YMarino, DSanderson, PEMosley, RRohrer, SPBirzin, ETHuskey, SEJacks, TSchleim, KDCheng, KSchaeffer, JMPatchett, AAYang, L Potent, orally bioavailable somatostatin agonists: good absorption achieved by urea backbone cyclization. Bioorg Med Chem Lett 9:491-6 (1999)  
Target
Name:
Somatostatin receptor type 2
Synonyms:
SOMATOSTATIN SST2 SS-2-R SS2R SSTR2 | Somatostatin receptor type 2 (SSTR2)
Type:
Enzyme
Mol. Mass.:
41344.94
Organism:
Homo sapiens (Human)
Description:
P30874
Residue:
369
  
Inhibitor
Name:
BDBM50075290
Synonyms:
(2R,3S)-N-(5-Amino-[1,3]dioxan-2-ylmethyl)-2-[3-(3,3-diphenyl-propyl)-2-oxo-imidazolidin-1-yl]-3-(1H-indol-3-yl)-N-methyl-butyramide | CHEMBL344511
Type:
Small organic molecule
Emp. Form.:
C36H43N5O4
Mol. Mass.:
609.7577
SMILES:
C[C@H]([C@@H](N1CCN(CCC(c2ccccc2)c2ccccc2)C1=O)C(=O)N(C)C[C@H]1OC[C@H](N)CO1)c1c[nH]c2ccccc12
: