Target
Tyrosine-protein kinase BTK
Ligand
BDBM50512857
Substrate
Meas. Tech.
ChEMBL_1883993 (CHEMBL4385492)
IC50
1.7±n/a nM
Citation
 Schnute, MEBenoit, SEBuchler, IPCaspers, NGrapperhaus, MLHan, SHotchandani, RHuang, NHughes, ROJuba, BMKim, KHLiu, EMcCarthy, EMessing, DMiyashiro, JSMohan, SO'Connell, TNOhren, JFParikh, MDSchmidt, MSelness, SRSpringer, JRThanabal, VTrujillo, JIWalker, DPWan, ZKWithka, JMWittwer, AJWood, NLXing, LZapf, CWDouhan, J Aminopyrazole Carboxamide Bruton's Tyrosine Kinase Inhibitors. Irreversible to Reversible Covalent Reactive Group Tuning. ACS Med Chem Lett 10:80-85 (2019)  
Target
Name:
Tyrosine-protein kinase BTK
Synonyms:
AGMX1 Agammaglobulinaemia tyrosine kinase B cell progenitor kinase BPK BTK_HUMAN Tyrosine Kinase BTK Tyrosine-protein kinase BTK (BTK)
Type:
Enzyme
Mol. Mass.:
76289.95
Organism:
Homo sapiens (Human)
Description:
Q06187
Residue:
659
  
Inhibitor
Name:
BDBM50512857
Synonyms:
CHEMBL4456283 | US10815213, Example 15
Type:
Small organic molecule
Emp. Form.:
C22H21ClN6O2
Mol. Mass.:
436.894
SMILES:
NC(=O)c1c(N)n(nc1-c1ccc(Oc2ccc(Cl)cc2)cc1)[C@@H]1CCCN(C1)C#N
: