Target
Beta-lactamase TEM
Ligand
BDBM50157692
Substrate
Meas. Tech.
ChEBML_41206
IC50
60±n/a nM
Citation
 Bitha, PLi, ZFrancisco, GDRasmussen, BALin, YI 6-(1-Hydroxyalkyl)penam sulfone derivatives as inhibitors of class A and class C beta-lactamases I. Bioorg Med Chem Lett 9:991-6 (1999)  
Target
Name:
Beta-lactamase TEM
Synonyms:
BLAT_ECOLX Beta-lactamase (TEM-1) Beta-lactamase TEM-1 Beta-lactamase TEM1D Beta-lactamase TEM1F TEM extended-spectrum beta-lactamase bla
Type:
Enzyme
Mol. Mass.:
31512.33
Organism:
Escherichia coli
Description:
P62593
Residue:
286
  
Inhibitor
Name:
BDBM50157692
Synonyms:
CHEMBL1439 Sodium; (2S,3S,5R)-3-methyl-4,4,7-trioxo-3-[1,2,3]triazol-1-ylmethyl-4lambda*6*-thia-1-aza-bicyclo[3.2.0]heptane-2-carboxylate US9035062, TAZ tazobactum
Type:
Small organic molecule
Emp. Form.:
C10H11N4NaO5S
Mol. Mass.:
322.273
SMILES:
C[C@]1(Cn2ccnn2)[C@@H](N2[C@@H](CC2=O)S1(=O)=O)C(=O)O[Na]
: