Target
Glutamate receptor ionotropic, NMDA 1
Ligand
BDBM50038178
Substrate
Meas. Tech.
ChEBML_140304
IC50
7370±n/a nM
Citation
 Cordi, ALacoste, JMAudinot, VMillan, M Design, synthesis and structure-activity relationships of novel strychnine-insensitive glycine receptor ligands. Bioorg Med Chem Lett 9:1409-14 (1999)  
Target
Name:
Glutamate receptor ionotropic, NMDA 1
Synonyms:
Glutamate (NMDA) receptor subunit zeta 1 Glutamate-NMDA-Channel Glutamate-NMDA-Polyamine NMDA Nmdar1 | phencyclidine
Type:
Enzyme Catalytic Domain
Mol. Mass.:
105533.40
Organism:
RAT
Description:
P35439
Residue:
938
  
Inhibitor
Name:
BDBM50038178
Synonyms:
(+)-4-Amino-3-isoxazolidinone (R)-4-AMINO-ISOXAZOLIDIN-3-ONE D-CYCLOSERINE cycloserine
Type:
Small organic molecule
Emp. Form.:
C3H6N2O2
Mol. Mass.:
102.0919
SMILES:
N[C@@H]1CON=C1O
: