Target
Prostaglandin G/H synthase 2
Ligand
BDBM50174201
Substrate
Meas. Tech.
ChEMBL_1889961 (CHEMBL4391715)
IC50
800±n/a nM
Citation
 Elzahhar, PAAlaaeddine, RIbrahim, TMNassra, RIsmail, AChua, BSKFrkic, RLBruning, JBWallner, NKnape, Tvon Knethen, ALabib, HEl-Yazbi, AFBelal, ASF Shooting three inflammatory targets with a single bullet: Novel multi-targeting anti-inflammatory glitazones. Eur J Med Chem 167:562-582 (2019)  
Target
Name:
Prostaglandin G/H synthase 2
Synonyms:
COX2 Cyclooxygenase 2 (COX-2) Cyclooxygenase-2 (COX-2 AA) Cyclooxygenase-2 (COX-2) PGH2_HUMAN PHS II Prostaglandin E synthase/G/H synthase 2 Prostaglandin-endoperoxide synthase 2
Type:
Enzyme
Mol. Mass.:
69003.89
Organism:
Homo sapiens (Human)
Description:
Recombinant Cox-2 provided by Cayman (Cayman Chemical Co.,Ann Arbor, MI).
Residue:
604
  
Inhibitor
Name:
BDBM50174201
Synonyms:
ARTHROTEC SOLARAZE US11173137, Compound Diclofenac VOLTAREN-XR sodium 2-(2-(2,6-dichlorophenylamino)phenyl)acetate
Type:
Small organic molecule
Emp. Form.:
C14H10Cl2NO2
Mol. Mass.:
295.141
SMILES:
[O-]C(=O)Cc1ccccc1Nc1c(Cl)cccc1Cl
: