Target
Alpha-1B adrenergic receptor
Ligand
BDBM50026917
Substrate
Meas. Tech.
ChEMBL_1890159 (CHEMBL4391913)
Ki
708±n/a nM
Citation
 Del Bello, FBonifazi, AGiorgioni, GQuaglia, WAmantini, CMorelli, MBSantoni, GBattiti, FOVistoli, GCilia, APiergentili, A Chemical manipulations on the 1,4-dioxane ring of 5-HT Eur J Med Chem 168:461-473 (2019)  
Target
Name:
Alpha-1B adrenergic receptor
Synonyms:
ADA1B_HUMAN Adrenergic alpha1B Adrenergic receptor alpha Alpha 1B-adrenoreceptor | Alpha-1B adrenergic receptor
Type:
Enzyme
Mol. Mass.:
56862.13
Organism:
Homo sapiens (Human)
Description:
P35368
Residue:
520
  
Inhibitor
Name:
BDBM50026917
Synonyms:
8-(2-(4-(2-methoxyphenyl)piperazin-1-yl)ethyl)-8-azaspiro[4.5]decane-7,9-dione 8-{2-[4-(2-Methoxy-phenyl)-piperazin-1-yl]-ethyl}-8-aza-spiro[4.5]decane-7,9-dione BMY 7378 CHEMBL1256934 CHEMBL543741
Type:
Small organic molecule
Emp. Form.:
C22H31N3O3
Mol. Mass.:
385.4998
SMILES:
COc1ccccc1N1CCN(CCN2C(=O)CC3(CCCC3)CC2=O)CC1
: