Target
Xaa-Pro dipeptidase
Ligand
BDBM50078401
Substrate
Meas. Tech.
ChEMBL_159885 (CHEMBL856203)
IC50
4900±n/a nM
Citation
 Maggiora, LLOrawski, ATSimmons, WH Apstatin analogue inhibitors of aminopeptidase P, a bradykinin-degrading enzyme. J Med Chem 42:2394-402 (1999)  
Target
Name:
Xaa-Pro dipeptidase
Synonyms:
PEPD PRD
Type:
PROTEIN
Mol. Mass.:
54541.05
Organism:
Homo sapiens (Human)
Description:
ChEMBL_159887
Residue:
493
  
Inhibitor
Name:
BDBM50078401
Synonyms:
(S)-1-[(S)-1-((2S,3R)-3-Amino-2-hydroxy-4-phenyl-butyryl)-pyrrolidine-2-carbonyl]-pyrrolidine-2-carboxylic acid ((S)-1-carbamoyl-ethyl)-amide N-[(2S,3R)-3-AMINO-2-HYDROXY-4-PHENYL-BUTANOYL]-L-PROLYL-L-PROLYL-L-ALANINAMIDE
Type:
Small organic molecule
Emp. Form.:
C23H33N5O5
Mol. Mass.:
459.5386
SMILES:
C[C@H](NC(=O)[C@@H]1CCCN1C(=O)[C@@H]1CCCN1C(=O)[C@@H](O)[C@H](N)Cc1ccccc1)C(N)=O
: