Target
Protein arginine N-methyltransferase 5
Ligand
BDBM50462572
Substrate
Meas. Tech.
ChEMBL_1890808 (CHEMBL4392562)
IC50
0.250000±n/a nM
Citation
 Lin, HLuengo, JI Nucleoside protein arginine methyltransferase 5 (PRMT5) inhibitors. Bioorg Med Chem Lett 29:1264-1269 (2019)  
Target
Name:
Protein arginine N-methyltransferase 5
Synonyms:
72 kDa ICln-binding protein HRMT1L5 IBP72 Jak-binding protein 1 PRMT5/MEP50 complex Protein arginine methyltransferase 5 (PRMT5) SKB1 homolog Shk1 kinase-binding protein 1 homolog
Type:
Enzyme
Mol. Mass.:
72679.99
Organism:
Homo sapiens (Human)
Description:
O14744
Residue:
637
  
Inhibitor
Name:
BDBM50462572
Synonyms:
CHEMBL4249337
Type:
Small organic molecule
Emp. Form.:
C22H23BrN6O2
Mol. Mass.:
483.361
SMILES:
Nc1nc2cc(CC[C@H]3C[C@H]([C@H](O)[C@@H]3O)n3ccc4c(N)ncnc34)ccc2cc1Br
: