Target
Muscarinic acetylcholine receptor M2
Ligand
BDBM50525132
Substrate
Meas. Tech.
ChEMBL_1895759 (CHEMBL4397794)
Ki
0.079433±n/a nM
Citation
 Pegoli, AWifling, DGruber, CGShe, XHübner, HBernhardt, GGmeiner, PKeller, M Conjugation of Short Peptides to Dibenzodiazepinone-Type Muscarinic Acetylcholine Receptor Ligands Determines M J Med Chem 62:5358-5369 (2019)  
Target
Name:
Muscarinic acetylcholine receptor M2
Synonyms:
ACM2_HUMAN Cholinergic, muscarinic M2 Muscarinic acetylcholine receptor M2 and M5 | RecName: Full=Muscarinic acetylcholine receptor M2
Type:
GPCR
Mol. Mass.:
51730.61
Organism:
Homo sapiens (Human)
Description:
P08172
Residue:
466
  
Inhibitor
Name:
BDBM50525132
Synonyms:
CHEMBL4451383
Type:
Small organic molecule
Emp. Form.:
C55H69F12N9O14
Mol. Mass.:
1308.1691
SMILES:
OC(=O)C(F)(F)F.OC(=O)C(F)(F)F.OC(=O)C(F)(F)F.OC(=O)C(F)(F)F.CC(=O)N[C@@H](Cc1ccc(O)cc1)C(=O)N[C@@H](CCCCN)C(=O)NCCN1CCN(CCCCC2CCN(CC(=O)N3c4ccccc4NC(=O)c4ccccc34)CC2)CC1
: