Target
Induced myeloid leukemia cell differentiation protein Mcl-1
Ligand
BDBM50078163
Substrate
Meas. Tech.
ChEMBL_1896444 (CHEMBL4398479)
Ki
0.450000±n/a nM
Citation
 Yang, SMao, YZhang, HXu, YAn, JHuang, Z The chemical biology of apoptosis: Revisited after 17 years. Eur J Med Chem 177:63-75 (2019)  
Target
Name:
Induced myeloid leukemia cell differentiation protein Mcl-1
Synonyms:
BCL2L3 Bcl-2-like protein 3 (Mcl-1) Bcl2-L-3 MCL1 Mcl-1 Myeloid cell leukemia sequence 1 (BCL2-related) | mcl1/EAT
Type:
Membrane; Single-pass membrane protein
Mol. Mass.:
37332.87
Organism:
Homo sapiens (Human)
Description:
Q07820
Residue:
350
  
Inhibitor
Name:
BDBM50078163
Synonyms:
CHEMBL3417704
Type:
Small organic molecule
Emp. Form.:
C46H55N7O7S
Mol. Mass.:
850.037
SMILES:
CN(C)S(=O)(=O)N1CCN(CC1)c1ccc(OCc2c(c(C)nn2C)-c2cccc3c(CCCOc4cccc5ccccc45)c(C(O)=O)n(CCN4CCOCC4)c23)cc1
: